{"text_format":"1","workbook":"xlsx","n_sheets":3,"sheets":["Sheet3","Summary","Template"],"not_rendered":{"charts":0,"images":0,"macros":1,"external_links":1,"defined_names":3,"comments":1,"pivot_tables":0},"unopened":[],"bounds":{"document_bytes":16777216,"sheet_cells":100000,"rows_first":2000,"rows_last":500,"rows_between":2000,"halvings":0,"cell_chars":16384,"cell_head_chars":4096},"cells_cut":0,"cells_raw":0,"read":"whole","date_system":"1900"}

{"sheet":"Sheet3","index":0,"n_rows":3993,"n_cols":22,"rows_kept":3993,"cut":false,"hidden":true,"merged":[[1,7,1,9]]}
["timesheet",null,null,null,"(V21 Mar25)"]
["Valid Code Combinations",null,null,null,null,null,null,"Unique Codes",null,null,null,null,null,null,null,null,"Month","Period",null,"Type of Work",null,"Department"]
["CC","NL","Project",null,"Valid Combination",null,null,"CC","NL","Project"]
["ACAL","1199","ALU00001",null,{"$f":"CONCATENATE(A4,B4,C4)","v":"ACAL1199ALU00001"},"OK",null,"ACAL",1100,"10000116",null,null,null,null,null,null,"July 2027",202612,null,"Overtime",null,"Accommodation"]
["ACAL","1199","CAR00001",null,"ACAL1199CAR00001","OK",null,"ACCE",1110,"10000190",null,null,null,null,null,null,"June 2027",202611,null,"Casual",null,"AVC Research"]
["ACAL","1199","CHR00001",null,"ACAL1199CHR00001","OK",null,"ACER",1120,"10000203",null,null,null,null,null,null,"May 2027",202610,null,"Holiday Pay",null,"Campus Services"]
["ACAL","1199","FOU00001",null,"ACAL1199FOU00001","OK",null,"ACFI",1121,"10000425",null,null,null,null,null,null,"April 2027",202609,null,"PTL",null,"Capstone Theatre"]
["ACAL","1199","GEN00001",null,"ACAL1199GEN00001","OK",null,"ACHR",1130,"10000448",null,null,null,null,null,null,"March 2027",202608,null,"Allowance",null,"Catering"]
["ACAL","1199","SCC00001",null,"ACAL1199SCC00001","OK",null,"ACPV",1135,"10000467",null,null,null,null,null,null,"February 2027",202607,null,"Fees",null,"Chaplaincy"]
["ACAL","1199","SDW01002",null,"ACAL1199SDW01002","OK",null,"ACRE",1188,"10000469",null,null,null,null,null,null,"January 2027",202606,null,"PILON",null,"Conferences"]
["ACAL","1199","SRE01000",null,"ACAL1199SRE01000","OK",null,"ACVC",1199,"10000487",null,null,null,null,null,null,"December 2026",202605,null,"Bonus",null,"Domestics"]
["ACAL","1199","SRE03000",null,"ACAL1199SRE03000","OK",null,"ADBC",1210,"10000502",null,null,null,null,null,null,"November 2026",202604,null,null,null,"Estates"]
["ACAL","1199","SRE06000",null,"ACAL1199SRE06000","OK",null,"ADBE",1230,"10000511",null,null,null,null,null,null,"October 2026",202603,null,"Academic",null,"Corporate Communications"]
["ACAL","1199","SWL00001",null,"ACAL1199SWL00001","OK",null,"ADBR",1300,"10000512",null,null,null,null,null,null,"September 2026",202602,null,"Support",null,"Finance"]
["ACAL","1300","ALU00001",null,"ACAL1300ALU00001","OK",null,"ADBS",1305,"10000522",null,null,null,null,null,null,"August 2026",202601,null,null,null,"Gateway"]
["ACAL","1300","CAR00001",null,"ACAL1300CAR00001","OK",null,"ADCA",1310,"10000525",null,null,null,null,null,null,"July 2026",202512,null,null,null,"Hope Works"]
["ACAL","1300","CHR00001",null,"ACAL1300CHR00001","OK",null,"ADCE",1320,"10000528",null,null,null,null,null,null,"June 2026",202511,null,null,null,"International Hub"]
["ACAL","1300","FOU00001",null,"ACAL1300FOU00001","OK",null,"ADCP",1330,"10000532",null,null,null,null,null,null,"May 2026",202510,null,null,null,"IT Services"]
["ACAL","1300","GEN00001",null,"ACAL1300GEN00001","OK",null,"ADDA",1430,"10000533",null,null,null,null,null,null,"April 2026",202509,null,null,null,"Student Learning"]
["ACAL","1300","SCC00001",null,"ACAL1300SCC00001","OK",null,"ADDP",1450,"10000542",null,null,null,null,null,null,"March 2026",202508,null,null,null,"Personnel"]
{"$rows_left_out":3974}
{"sheet":"Summary","index":1,"n_rows":62,"n_cols":22,"rows_kept":62,"cut":false,"hidden":true,"merged":[[59,17,59,18],[59,19,59,21],[60,19,60,21],[61,17,61,18],[61,19,61,21],[0,0,0,21],[1,0,1,21],[2,0,2,21],[3,0,3,21],[5,17,5,18],[5,2,5,4],[5,9,5,13],[57,17,57,18],[57,19,57,21],[58,19,58,21],[8,2,8,3],[8,16,8,18],[56,19,56,21]]}
["Hourly Paid Timesheet "]
["Hand in by published deadline"]
["Supervisor must sign at bottom enable payment"]
["Failure to sign may delay payment "]
[]
[null,"Faculty/Area:","Summary",null,null,null,null,null,"Budget Holder:",null,null,null,null,null,null,null,"Month:",null,null,null,null,{"$f":"IF(Template!V6=\"\",\"\",CONCATENATE(LEFT(Template!V6,4),\"-\",RIGHT(LEFT(Template!V6,4),2)+1))","v":""}]
[]
[]
["No","Employee","Name",null,"Department","Work Details","Work Type","Date ","Date ","Total Hours","Rate","Annual","Total Hours","Pay","Holiday Pay","Total Pay","Agresso Coding"]
[null,"Number","Forename","Surname",null,"(brief overview)",null,"From","To","Worked","£","Leave","Accrued","£","£","£","Cost Centre","Account Code","Project Code"]
[]
[{"$f":"IF(Template!A12=\"\",\"\",CONCATENATE(Template!$V$6,\".\",IF(Template!A12<10,CONCATENATE(\"0\",Template!A12),Template!A12)))","v":""},{"$f":"IF(Template!B12=\"\",\"\",Template!B12)","v":""},{"$f":"IF(Template!C12=\"\",\"\",Template!C12)","v":""},{"$f":"IF(Template!D12=\"\",\"\",Template!D12)","v":""},{"$f":"IF(Template!E12=\"\",\"\",Template!E12)","v":""},{"$f":"IF(Template!F12=\"\",\"\",Template!F12)","v":""},{"$f":"IF(Template!G12=\"\",\"\",Template!G12)","v":""},{"$f":"IF(Template!H12=\"\",\"\",Template!H12)","v":""},{"$f":"IF(Template!I12=\"\",\"\",Template!I12)","v":""},{"$f":"IF(Template!J12=\"\",\"\",Template!J12)","v":""},{"$f":"IF(Template!K12=\"\",\"\",Template!K12)","v":""},{"$f":"IF(Template!L12=\"\",\"\",Template!L12)","v":""},{"$f":"IF(Template!M12=\"\",\"\",Template!M12)","v":""},{"$f":"IF(Template!N12=\"\",\"\",Template!N12)","v":""},{"$f":"IF(Template!O12=\"\",\"\",Template!O12)","v":""},{"$f":"IF(Template!P12=\"\",\"\",Template!P12)","v":""},{"$f":"IF(Template!Q12=\"\",\"\",Template!Q12)","v":""},{"$f":"IF(Template!R12=\"\",\"\",Template!R12)","v":""},{"$f":"IF(Template!S12=\"\",\"\",Template!S12)","v":""},{"$f":"IF(Template!T20=\"\",\"\",Template!T20)","v":""},{"$f":"IF(Template!U20=\"\",\"\",Template!U20)","v":""}]
[{"$f":"IF(Template!A13=\"\",\"\",CONCATENATE(Template!$V$6,\".\",IF(Template!A13<10,CONCATENATE(\"0\",Template!A13),Template!A13)))","v":""},{"$f":"IF(Template!B13=\"\",\"\",Template!B13)","v":""},{"$f":"IF(Template!C13=\"\",\"\",Template!C13)","v":""},{"$f":"IF(Template!D13=\"\",\"\",Template!D13)","v":""},{"$f":"IF(Template!E13=\"\",\"\",Template!E13)","v":""},{"$f":"IF(Template!F13=\"\",\"\",Template!F13)","v":""},{"$f":"IF(Template!G13=\"\",\"\",Template!G13)","v":""},{"$f":"IF(Template!H13=\"\",\"\",Template!H13)","v":""},{"$f":"IF(Template!I13=\"\",\"\",Template!I13)","v":""},{"$f":"IF(Template!J13=\"\",\"\",Template!J13)","v":""},{"$f":"IF(Template!K13=\"\",\"\",Template!K13)","v":""},{"$f":"IF(Template!L13=\"\",\"\",Template!L13)","v":""},{"$f":"IF(Template!M13=\"\",\"\",Template!M13)","v":""},{"$f":"IF(Template!N13=\"\",\"\",Template!N13)","v":""},{"$f":"IF(Template!O13=\"\",\"\",Template!O13)","v":""},{"$f":"IF(Template!P13=\"\",\"\",Template!P13)","v":""},{"$f":"IF(Template!Q13=\"\",\"\",Template!Q13)","v":""},{"$f":"IF(Template!R13=\"\",\"\",Template!R13)","v":""},{"$f":"IF(Template!S13=\"\",\"\",Template!S13)","v":""},{"$f":"IF(Template!T21=\"\",\"\",Template!T21)","v":""},{"$f":"IF(Template!U21=\"\",\"\",Template!U21)","v":""}]
[{"$f":"IF(Template!A14=\"\",\"\",CONCATENATE(Template!$V$6,\".\",IF(Template!A14<10,CONCATENATE(\"0\",Template!A14),Template!A14)))","v":""},{"$f":"IF(Template!B14=\"\",\"\",Template!B14)","v":""},{"$f":"IF(Template!C14=\"\",\"\",Template!C14)","v":""},{"$f":"IF(Template!D14=\"\",\"\",Template!D14)","v":""},{"$f":"IF(Template!E14=\"\",\"\",Template!E14)","v":""},{"$f":"IF(Template!F14=\"\",\"\",Template!F14)","v":""},{"$f":"IF(Template!G14=\"\",\"\",Template!G14)","v":""},{"$f":"IF(Template!H14=\"\",\"\",Template!H14)","v":""},{"$f":"IF(Template!I14=\"\",\"\",Template!I14)","v":""},{"$f":"IF(Template!J14=\"\",\"\",Template!J14)","v":""},{"$f":"IF(Template!K14=\"\",\"\",Template!K14)","v":""},{"$f":"IF(Template!L14=\"\",\"\",Template!L14)","v":""},{"$f":"IF(Template!M14=\"\",\"\",Template!M14)","v":""},{"$f":"IF(Template!N14=\"\",\"\",Template!N14)","v":""},{"$f":"IF(Template!O14=\"\",\"\",Template!O14)","v":""},{"$f":"IF(Template!P14=\"\",\"\",Template!P14)","v":""},{"$f":"IF(Template!Q14=\"\",\"\",Template!Q14)","v":""},{"$f":"IF(Template!R14=\"\",\"\",Template!R14)","v":""},{"$f":"IF(Template!S14=\"\",\"\",Template!S14)","v":""},{"$f":"IF(Template!T22=\"\",\"\",Template!T22)","v":""},{"$f":"IF(Template!U22=\"\",\"\",Template!U22)","v":""}]
[{"$f":"IF(Template!A15=\"\",\"\",CONCATENATE(Template!$V$6,\".\",IF(Template!A15<10,CONCATENATE(\"0\",Template!A15),Template!A15)))","v":""},{"$f":"IF(Template!B15=\"\",\"\",Template!B15)","v":""},{"$f":"IF(Template!C15=\"\",\"\",Template!C15)","v":""},{"$f":"IF(Template!D15=\"\",\"\",Template!D15)","v":""},{"$f":"IF(Template!E15=\"\",\"\",Template!E15)","v":""},{"$f":"IF(Template!F15=\"\",\"\",Template!F15)","v":""},{"$f":"IF(Template!G15=\"\",\"\",Template!G15)","v":""},{"$f":"IF(Template!H15=\"\",\"\",Template!H15)","v":""},{"$f":"IF(Template!I15=\"\",\"\",Template!I15)","v":""},{"$f":"IF(Template!J15=\"\",\"\",Template!J15)","v":""},{"$f":"IF(Template!K15=\"\",\"\",Template!K15)","v":""},{"$f":"IF(Template!L15=\"\",\"\",Template!L15)","v":""},{"$f":"IF(Template!M15=\"\",\"\",Template!M15)","v":""},{"$f":"IF(Template!N15=\"\",\"\",Template!N15)","v":""},{"$f":"IF(Template!O15=\"\",\"\",Template!O15)","v":""},{"$f":"IF(Template!P15=\"\",\"\",Template!P15)","v":""},{"$f":"IF(Template!Q15=\"\",\"\",Template!Q15)","v":""},{"$f":"IF(Template!R15=\"\",\"\",Template!R15)","v":""},{"$f":"IF(Template!S15=\"\",\"\",Template!S15)","v":""},{"$f":"IF(Template!T23=\"\",\"\",Template!T23)","v":""},{"$f":"IF(Template!U23=\"\",\"\",Template!U23)","v":""}]
[{"$f":"IF(Template!A16=\"\",\"\",CONCATENATE(Template!$V$6,\".\",IF(Template!A16<10,CONCATENATE(\"0\",Template!A16),Template!A16)))","v":""},{"$f":"IF(Template!B16=\"\",\"\",Template!B16)","v":""},{"$f":"IF(Template!C16=\"\",\"\",Template!C16)","v":""},{"$f":"IF(Template!D16=\"\",\"\",Template!D16)","v":""},{"$f":"IF(Template!E16=\"\",\"\",Template!E16)","v":""},{"$f":"IF(Template!F16=\"\",\"\",Template!F16)","v":""},{"$f":"IF(Template!G16=\"\",\"\",Template!G16)","v":""},{"$f":"IF(Template!H16=\"\",\"\",Template!H16)","v":""},{"$f":"IF(Template!I16=\"\",\"\",Template!I16)","v":""},{"$f":"IF(Template!J16=\"\",\"\",Template!J16)","v":""},{"$f":"IF(Template!K16=\"\",\"\",Template!K16)","v":""},{"$f":"IF(Template!L16=\"\",\"\",Template!L16)","v":""},{"$f":"IF(Template!M16=\"\",\"\",Template!M16)","v":""},{"$f":"IF(Template!N16=\"\",\"\",Template!N16)","v":""},{"$f":"IF(Template!O16=\"\",\"\",Template!O16)","v":""},{"$f":"IF(Template!P16=\"\",\"\",Template!P16)","v":""},{"$f":"IF(Template!Q16=\"\",\"\",Template!Q16)","v":""},{"$f":"IF(Template!R16=\"\",\"\",Template!R16)","v":""},{"$f":"IF(Template!S16=\"\",\"\",Template!S16)","v":""},{"$f":"IF(Template!T24=\"\",\"\",Template!T24)","v":""},{"$f":"IF(Template!U24=\"\",\"\",Template!U24)","v":""}]
[{"$f":"IF(Template!A17=\"\",\"\",CONCATENATE(Template!$V$6,\".\",IF(Template!A17<10,CONCATENATE(\"0\",Template!A17),Template!A17)))","v":""},{"$f":"IF(Template!B17=\"\",\"\",Template!B17)","v":""},{"$f":"IF(Template!C17=\"\",\"\",Template!C17)","v":""},{"$f":"IF(Template!D17=\"\",\"\",Template!D17)","v":""},{"$f":"IF(Template!E17=\"\",\"\",Template!E17)","v":""},{"$f":"IF(Template!F17=\"\",\"\",Template!F17)","v":""},{"$f":"IF(Template!G17=\"\",\"\",Template!G17)","v":""},{"$f":"IF(Template!H17=\"\",\"\",Template!H17)","v":""},{"$f":"IF(Template!I17=\"\",\"\",Template!I17)","v":""},{"$f":"IF(Template!J17=\"\",\"\",Template!J17)","v":""},{"$f":"IF(Template!K17=\"\",\"\",Template!K17)","v":""},{"$f":"IF(Template!L17=\"\",\"\",Template!L17)","v":""},{"$f":"IF(Template!M17=\"\",\"\",Template!M17)","v":""},{"$f":"IF(Template!N17=\"\",\"\",Template!N17)","v":""},{"$f":"IF(Template!O17=\"\",\"\",Template!O17)","v":""},{"$f":"IF(Template!P17=\"\",\"\",Template!P17)","v":""},{"$f":"IF(Template!Q17=\"\",\"\",Template!Q17)","v":""},{"$f":"IF(Template!R17=\"\",\"\",Template!R17)","v":""},{"$f":"IF(Template!S17=\"\",\"\",Template!S17)","v":""},{"$f":"IF(Template!T25=\"\",\"\",Template!T25)","v":""},{"$f":"IF(Template!U25=\"\",\"\",Template!U25)","v":""}]
[{"$f":"IF(Template!A18=\"\",\"\",CONCATENATE(Template!$V$6,\".\",IF(Template!A18<10,CONCATENATE(\"0\",Template!A18),Template!A18)))","v":""},{"$f":"IF(Template!B18=\"\",\"\",Template!B18)","v":""},{"$f":"IF(Template!C18=\"\",\"\",Template!C18)","v":""},{"$f":"IF(Template!D18=\"\",\"\",Template!D18)","v":""},{"$f":"IF(Template!E18=\"\",\"\",Template!E18)","v":""},{"$f":"IF(Template!F18=\"\",\"\",Template!F18)","v":""},{"$f":"IF(Template!G18=\"\",\"\",Template!G18)","v":""},{"$f":"IF(Template!H18=\"\",\"\",Template!H18)","v":""},{"$f":"IF(Template!I18=\"\",\"\",Template!I18)","v":""},{"$f":"IF(Template!J18=\"\",\"\",Template!J18)","v":""},{"$f":"IF(Template!K18=\"\",\"\",Template!K18)","v":""},{"$f":"IF(Template!L18=\"\",\"\",Template!L18)","v":""},{"$f":"IF(Template!M18=\"\",\"\",Template!M18)","v":""},{"$f":"IF(Template!N18=\"\",\"\",Template!N18)","v":""},{"$f":"IF(Template!O18=\"\",\"\",Template!O18)","v":""},{"$f":"IF(Template!P18=\"\",\"\",Template!P18)","v":""},{"$f":"IF(Template!Q18=\"\",\"\",Template!Q18)","v":""},{"$f":"IF(Template!R18=\"\",\"\",Template!R18)","v":""},{"$f":"IF(Template!S18=\"\",\"\",Template!S18)","v":""},{"$f":"IF(Template!T26=\"\",\"\",Template!T26)","v":""},{"$f":"IF(Template!U26=\"\",\"\",Template!U26)","v":""}]
[{"$f":"IF(Template!A19=\"\",\"\",CONCATENATE(Template!$V$6,\".\",IF(Template!A19<10,CONCATENATE(\"0\",Template!A19),Template!A19)))","v":""},{"$f":"IF(Template!B19=\"\",\"\",Template!B19)","v":""},{"$f":"IF(Template!C19=\"\",\"\",Template!C19)","v":""},{"$f":"IF(Template!D19=\"\",\"\",Template!D19)","v":""},{"$f":"IF(Template!E19=\"\",\"\",Template!E19)","v":""},{"$f":"IF(Template!F19=\"\",\"\",Template!F19)","v":""},{"$f":"IF(Template!G19=\"\",\"\",Template!G19)","v":""},{"$f":"IF(Template!H19=\"\",\"\",Template!H19)","v":""},{"$f":"IF(Template!I19=\"\",\"\",Template!I19)","v":""},{"$f":"IF(Template!J19=\"\",\"\",Template!J19)","v":""},{"$f":"IF(Template!K19=\"\",\"\",Template!K19)","v":""},{"$f":"IF(Template!L19=\"\",\"\",Template!L19)","v":""},{"$f":"IF(Template!M19=\"\",\"\",Template!M19)","v":""},{"$f":"IF(Template!N19=\"\",\"\",Template!N19)","v":""},{"$f":"IF(Template!O19=\"\",\"\",Template!O19)","v":""},{"$f":"IF(Template!P19=\"\",\"\",Template!P19)","v":""},{"$f":"IF(Template!Q19=\"\",\"\",Template!Q19)","v":""},{"$f":"IF(Template!R19=\"\",\"\",Template!R19)","v":""},{"$f":"IF(Template!S19=\"\",\"\",Template!S19)","v":""},{"$f":"IF(Template!T27=\"\",\"\",Template!T27)","v":""},{"$f":"IF(Template!U27=\"\",\"\",Template!U27)","v":""}]
[{"$f":"IF(Template!A20=\"\",\"\",CONCATENATE(Template!$V$6,\".\",IF(Template!A20<10,CONCATENATE(\"0\",Template!A20),Template!A20)))","v":""},{"$f":"IF(Template!B20=\"\",\"\",Template!B20)","v":""},{"$f":"IF(Template!C20=\"\",\"\",Template!C20)","v":""},{"$f":"IF(Template!D20=\"\",\"\",Template!D20)","v":""},{"$f":"IF(Template!E20=\"\",\"\",Template!E20)","v":""},{"$f":"IF(Template!F20=\"\",\"\",Template!F20)","v":""},{"$f":"IF(Template!G20=\"\",\"\",Template!G20)","v":""},{"$f":"IF(Template!H20=\"\",\"\",Template!H20)","v":""},{"$f":"IF(Template!I20=\"\",\"\",Template!I20)","v":""},{"$f":"IF(Template!J20=\"\",\"\",Template!J20)","v":""},{"$f":"IF(Template!K20=\"\",\"\",Template!K20)","v":""},{"$f":"IF(Template!L20=\"\",\"\",Template!L20)","v":""},{"$f":"IF(Template!M20=\"\",\"\",Template!M20)","v":""},{"$f":"IF(Template!N20=\"\",\"\",Template!N20)","v":""},{"$f":"IF(Template!O20=\"\",\"\",Template!O20)","v":""},{"$f":"IF(Template!P20=\"\",\"\",Template!P20)","v":""},{"$f":"IF(Template!Q20=\"\",\"\",Template!Q20)","v":""},{"$f":"IF(Template!R20=\"\",\"\",Template!R20)","v":""},{"$f":"IF(Template!S20=\"\",\"\",Template!S20)","v":""},{"$f":"IF(Template!T28=\"\",\"\",Template!T28)","v":""},{"$f":"IF(Template!U28=\"\",\"\",Template!U28)","v":""}]
{"$rows_left_out":43}
{"sheet":"Template","index":2,"n_rows":62,"n_cols":22,"rows_kept":62,"cut":false,"hidden":false,"merged":[[56,19,56,21],[2,0,2,21],[3,0,3,21],[8,16,8,18],[8,2,8,3],[5,17,5,18],[5,2,5,4],[5,9,5,13],[57,19,57,21],[58,19,58,21],[59,19,59,21],[60,19,60,21],[61,19,61,21],[0,0,0,17],[57,17,57,18],[59,17,59,18],[1,0,1,17],[61,17,61,18]]}
["                   Hourly Paid Timesheet",null,null,null,null,null,null,null,null,null,null,null,null,null,null,null,null,null,{"$f":"Sheet3!E1","v":"(V21 Mar25)"}]
["                      Hand in by published deadline",null,null,null,null,null,null,null,null,null,null,null,null,null,null,null,null,null,"Web Page Link"]
["Supervisor must sign at bottom enable payment"]
["Failure to sign may delay payment "]
[]
[null,"Faculty/Area:",null,null,null,null,null,null,"Budget Holder:",null,null,null,null,null,null,null,"Month:",null,null,null,null,{"$f":"IF(R6=\"\",\"\",VLOOKUP(R6,Sheet3!Q4:R40,2))","v":""}]
[]
[]
["No","Employee","Name",null,"Department","Work Details","Work Type","Date ","Date ","Total Hours","Rate","Annual","Total Hours","Pay","Holiday Pay","Total Pay","Agresso Coding",null,null,null,null,{"$f":"IF(COUNTIF($V$12:$V$56,\"INVALID COMBINATION\")=0,\"Code Combinations OK\",CONCATENATE(COUNTIF($V$12:$V$56,\"INVALID COMBINATION\"),\" Invalid Combination\"))","v":"Code Combinations OK"}]
[null,"Number","Forename","Surname",null,"(brief overview)",null,"From","To","Worked","£","Leave","Accrued","£","£","£","Cost Centre","Account Code","Project Code",null,null,{"$f":"IF(COUNTIF($V$12:$V$56,\"No Coding\")=0,\"Codes entered OK\",CONCATENATE(COUNTIF($V$12:$V$56,\"No Coding\"),\" Missing Codes\"))","v":"Codes entered OK"}]
["Example",12345678,"Fred","Blogs","Catering","HP Form Design","Support","2018-08-01","2018-08-01",10,7.38,0.1207,1.167,73.8,8.61,82.41,"ACFI",1300,"GEN00001",null,"ACFI1300GEN00001",{"$f":"IF(P11=\"\",\"\",IF(AND(S11=\"\",R11=\"\",Q11=\"\"),\"No Coding\",IF(U11=\"\",\" \",IFERROR(VLOOKUP($U:$U,[1]Sheet3!E:F,2,FALSE),\"INVALID COMBINATION\"))))","v":"OK"}]
[{"$f":"IF(CONCATENATE(B12,D12,H12,N12,O12,Q12)=\"\",\"\",CONCATENATE(LEFT($C$6,3),IF(A11=\"example\",1,RIGHT(A11,LEN(A11)-3)+1)))","v":""},null,null,null,null,null,null,null,null,null,null,{"$f":"IF(G12=\"support\",0.1207,\"\")","v":""},{"$f":"IF(J12=0,\"\",IF(L12=\"\",0,J12*L12))","v":""},{"$f":"IF(J12=\"\",\"\",K12*J12)","v":""},{"$f":"IF(M12=\"\",\"\",ROUND(M12*K12,2))","v":""},{"$f":"IF(SUM(N12:O12)=0,\"\",SUM(N12:O12))","v":""},null,null,null,null,{"$f":"CONCATENATE(Q12,R12,S12)","v":""},{"$f":"IF(P12=\"\",\"\",IF(AND(S12=\"\",R12=\"\",Q12=\"\"),\"No Coding\",IF(U12=\"\",\" \",IFERROR(VLOOKUP($U:$U,Sheet3!E:F,2,FALSE),\"INVALID COMBINATION\"))))","v":""}]
[{"$f":"IF(CONCATENATE(B13,D13,H13,N13,O13,Q13)=\"\",\"\",CONCATENATE(LEFT($C$6,3),IF(A12=\"example\",1,RIGHT(A12,LEN(A12)-3)+1)))","v":""},null,null,null,null,null,null,null,null,null,null,{"$f":"IF(G13=\"support\",0.1207,\"\")","v":""},{"$f":"IF(J13=0,\"\",IF(L13=\"\",0,J13*L13))","v":""},{"$f":"IF(J13=\"\",\"\",K13*J13)","v":""},{"$f":"IF(M13=\"\",\"\",ROUND(M13*K13,2))","v":""},{"$f":"IF(SUM(N13:O13)=0,\"\",SUM(N13:O13))","v":""},null,null,null,null,{"$f":"CONCATENATE(Q13,R13,S13)","v":""},{"$f":"IF(P13=\"\",\"\",IF(AND(S13=\"\",R13=\"\",Q13=\"\"),\"No Coding\",IF(U13=\"\",\" \",IFERROR(VLOOKUP($U:$U,Sheet3!E:F,2,FALSE),\"INVALID COMBINATION\"))))","v":""}]
[{"$f":"IF(CONCATENATE(B14,D14,H14,N14,O14,Q14)=\"\",\"\",CONCATENATE(LEFT($C$6,3),IF(A13=\"example\",1,RIGHT(A13,LEN(A13)-3)+1)))","v":""},null,null,null,null,null,null,null,null,null,null,"","","","","",null,null,null,null,"",{"$f":"IF(P14=\"\",\"\",IF(AND(S14=\"\",R14=\"\",Q14=\"\"),\"No Coding\",IF(U14=\"\",\" \",IFERROR(VLOOKUP($U:$U,Sheet3!E:F,2,FALSE),\"INVALID COMBINATION\"))))","v":""}]
[{"$f":"IF(CONCATENATE(B15,D15,H15,N15,O15,Q15)=\"\",\"\",CONCATENATE(LEFT($C$6,3),IF(A14=\"example\",1,RIGHT(A14,LEN(A14)-3)+1)))","v":""},null,null,null,null,null,null,null,null,null,null,"","","","","",null,null,null,null,"",{"$f":"IF(P15=\"\",\"\",IF(AND(S15=\"\",R15=\"\",Q15=\"\"),\"No Coding\",IF(U15=\"\",\" \",IFERROR(VLOOKUP($U:$U,Sheet3!E:F,2,FALSE),\"INVALID COMBINATION\"))))","v":""}]
["",null,null,null,null,null,null,null,null,null,null,"","","","","",null,null,null,null,"",{"$f":"IF(P16=\"\",\"\",IF(AND(S16=\"\",R16=\"\",Q16=\"\"),\"No Coding\",IF(U16=\"\",\" \",IFERROR(VLOOKUP($U:$U,Sheet3!E:F,2,FALSE),\"INVALID COMBINATION\"))))","v":""}]
["",null,null,null,null,null,null,null,null,null,null,"","","","","",null,null,null,null,"",{"$f":"IF(P17=\"\",\"\",IF(AND(S17=\"\",R17=\"\",Q17=\"\"),\"No Coding\",IF(U17=\"\",\" \",IFERROR(VLOOKUP($U:$U,Sheet3!E:F,2,FALSE),\"INVALID COMBINATION\"))))","v":""}]
["",null,null,null,null,null,null,null,null,null,null,"","","","","",null,null,null,null,"",{"$f":"IF(P18=\"\",\"\",IF(AND(S18=\"\",R18=\"\",Q18=\"\"),\"No Coding\",IF(U18=\"\",\" \",IFERROR(VLOOKUP($U:$U,Sheet3!E:F,2,FALSE),\"INVALID COMBINATION\"))))","v":""}]
["",null,null,null,null,null,null,null,null,null,null,"","","","","",null,null,null,null,"",{"$f":"IF(P19=\"\",\"\",IF(AND(S19=\"\",R19=\"\",Q19=\"\"),\"No Coding\",IF(U19=\"\",\" \",IFERROR(VLOOKUP($U:$U,Sheet3!E:F,2,FALSE),\"INVALID COMBINATION\"))))","v":""}]
["",null,null,null,null,null,null,null,null,null,null,"","","","","",null,null,null,null,"",{"$f":"IF(P20=\"\",\"\",IF(AND(S20=\"\",R20=\"\",Q20=\"\"),\"No Coding\",IF(U20=\"\",\" \",IFERROR(VLOOKUP($U:$U,Sheet3!E:F,2,FALSE),\"INVALID COMBINATION\"))))","v":""}]
{"$rows_left_out":42}